{"text_format":"1","workbook":"xlsx","n_sheets":7,"sheets":["Listen","Allgemeine Angaben","Terminplan WVU","Terminplan GA","MP1","MP2","MP3"],"not_rendered":{"charts":0,"images":0,"macros":0,"external_links":1,"defined_names":12,"comments":6,"pivot_tables":0},"unopened":[],"bounds":{"document_bytes":16777216,"sheet_cells":100000,"rows_first":2000,"rows_last":500,"rows_between":2000,"halvings":0,"cell_chars":16384,"cell_head_chars":4096},"cells_cut":0,"cells_raw":0,"read":"whole","date_system":"1900"}

{"sheet":"Listen","index":0,"n_rows":19,"n_cols":11,"rows_kept":19,"cut":false,"hidden":true,"merged":[]}
["Dropdown-Listen, die in den anderen Arbeitsblättern verwendet werden."]
["Achtung, Änderungen hier haben Auswirkungen auf die Bearbeitung in den anderen Tabellen!"]
[]
["Probennahmeverfahren",null,null,null,"Code: Stelle der Probennahme",null,"Untersuchung durch",null,"Erläuterung zur Wasserabgabemenge",null,"Arbeitsblätter"]
[]
["DIN EN ISO 19458, Zweck a)",null,null,null,"W: Wasserwerk(sausgang)",null,"Eigenüberwachung UsI",null,"Gesamte Wasserabgabe (Endverbraucher und Abgabe an andere zentrale WVA)",null,{"$f":"IFERROR(INDEX(Arbeitsblätter,ROW($A1)),\"\")","v":""}]
["DIN EN ISO 19458, Zweck b)",null,null,null,"N: Öffentliches Verteilungsnetz",null,"GA, § 19 Abs. 1 TrinkwV",null,"Wasserabgabe an Endverbraucher (ggf. abzüglich Wasserabgabe an andere zentrale WVA)",null,{"$f":"IFERROR(INDEX(Arbeitsblätter,ROW($A2)),\"\")","v":""}]
[null,null,null,null,"L: Übergabestelle Trinkwasser-Installation, z.B. Wasserzähler",null,"GA, § 19 Abs. 7 TrinkwV",null,"Wasserabgabe an andere zentrale WVA (z.B. bei Fernwasserversorgern)",null,""]
["Spülprobe DIN ISO 5667- 5",null,null,null,"T: Häusliche Trinkwasserinstallation",null,null,null,null,null,""]
["Gestaffelte Stagnationsbeprobung (UBA)",null,null,null,null,null,null,null,null,null,""]
["Zufallsstichprobe (UBA)",null,null,null,null,null,null,null,null,null,""]
[null,null,null,null,null,null,null,null,null,null,""]
[null,null,null,null,null,null,null,null,null,null,""]
[null,null,null,null,null,null,null,null,null,null,""]
[null,null,null,null,null,null,null,null,null,null,""]
[null,null,null,null,null,null,null,null,null,null,""]
[null,null,null,null,null,null,null,null,null,null,""]
[null,null,null,null,null,null,null,null,null,null,""]
[null,null,null,null,null,null,null,null,null,null,""]

{"sheet":"Allgemeine Angaben","index":1,"n_rows":22,"n_cols":2,"rows_kept":22,"cut":false,"hidden":false,"merged":[]}
["Probennahmeplan Berichtsjahr",2014]
["Auszufüllen durch Gesundheitsamt, ggf. in Abstimmung mit dem Wasserversorgungsunternehmen. Kommentare beachten!"]
[]
["Wasserversorgungsunternehmen:"]
["Wasserversorgungsanlage:"]
["Wasserabgabe (Vorjahr) in m³/Jahr:"]
["Erläuterung zur Wasserabgabemenge:"]
["Wasserabgabe (Vorjahr) in m³/Tag:"]
["Anzahl routinemäßige Untersuchungen pro Jahr:"]
["                            davon abzudecken durch das WVU:"]
["Anzahl umfassende Untersuchungen pro Jahr:"]
["                           davon abzudecken durch das WVU:"]
[]
["Fernwasserversorgungsanlage (ja/nein):"]
["Erfolgt aus der Fernwasserversorgung auch eine direkte Versorgung von Endverbrauchern (mindestens 10 m³/d oder mindestens 50 Personen)? (ja/nein)"]
[]
["Wasserabgabe an Endverbraucher aus Fernwasserversorgungsanlage (Vorjahr) in m³/Jahr:"]
["Wasserabgabe an Endverbraucher aus Fernwasserversorgungsanlage (Vorjahr) in m³/Tag:"]
["Anzahl routinemäßige Untersuchungen aus Wasserabgabe an Endverbraucher pro Jahr:"]
["Anzahl umfassende Untersuchungen aus Wasserabgabe an Endverbraucher pro Jahr:"]
[]
["Kontaktdaten Gesundheitsamt:"]

{"sheet":"Terminplan WVU","index":2,"n_rows":1005,"n_cols":20,"rows_kept":1005,"cut":false,"hidden":false,"merged":[[1,0,1,6],[3,7,3,18]]}
["Terminplan WVU",null,{"$f":"CONCATENATE('Allgemeine Angaben'!B5,\" \",'Allgemeine Angaben'!B1)","v":" 2014"}]
["Auszufüllen durch das Wasserversorgungsunternehmen. Durch die Probennahmen sind die vom Gesundheitsamt vorgegebenen Anzahlen der routinemäßigen und umfassenden Untersuchungen abzudecken, aber nicht wesentlich zu überschreiten. Zusätzliche Probennahmen können aufgeführt werden, müssen aber als solche in der Spalte Bemerkung als \"Eigenüberwachung\" gekennzeichnet werden und gehen nicht in den Jahresbericht ein. \nDiese Tabelle kann auf den Umfang der tatsächlich notwendigen Probennahmen eingekürzt werden."]
[]
["Lfd.Nr.","Datum (Kalenderwoche)","Messprogramm\n","Objektkennzahl","Name Messstelle","bei Sammelmessstellen: \n","Stelle der Probennahme (Code)\n","Probennahmeverfahren (Zutreffendes bitte aus Dropdownliste auswählen!)",null,null,null,null,null,null,null,null,null,null,null,"Bemerkung"]
[null,null,"(MP1 oder MP2…, zutreffendes bitte aus Dropdownliste auswählen!)",null,null,"eindeutige Bezeichnung der Probenentnahmestelle","(Zutreffendes bitte aus Dropdownliste auswählen!)","E. coli","Coliforme Bakt.","Koloniezahl  22°C","Koloniezahl 36°C","C. perfringens","P.aeruginosa.","Enterokken","Probennahme Mikrobiologie","Kupfer","Nickel","Blei","Probennahme Schwermetalle"]
["WVU 1",null,null,null,null,null,null,{"$f":"IF(OR($C6=\"\",ISNA(VLOOKUP(\"Escherichia coli (E. coli)\",INDIRECT($C6&\"!B6:C100\"),2,FALSE))=TRUE),\"\",IF(VLOOKUP(\"Escherichia coli (E. coli)\",INDIRECT($C6&\"!B6:C100\"),2,FALSE)=0,\"\",VLOOKUP(\"Escherichia coli (E. coli)\",INDIRECT($C6&\"!B6:C100\"),2,FALSE)))","v":""},{"$f":"IF(OR($C6=\"\",ISNA(VLOOKUP(\"Coliforme Bakterien\",INDIRECT($C6&\"!B6:C100\"),2,FALSE))=TRUE),\"\",IF(VLOOKUP(\"Coliforme Bakterien\",INDIRECT($C6&\"!B6:C100\"),2,FALSE)=0,\"\",VLOOKUP(\"Coliforme Bakterien\",INDIRECT($C6&\"!B6:C100\"),2,FALSE)))","v":""},{"$f":"IF(OR($C6=\"\",ISNA(VLOOKUP(\"Koloniezahl bei 22°C\",INDIRECT($C6&\"!B6:C100\"),2,FALSE))=TRUE),\"\",IF(VLOOKUP(\"Koloniezahl bei 22°C\",INDIRECT($C6&\"!B6:C100\"),2,FALSE)=0,\"\",VLOOKUP(\"Koloniezahl bei 22°C\",INDIRECT($C6&\"!B6:C100\"),2,FALSE)))","v":""},{"$f":"IF(OR($C6=\"\",ISNA(VLOOKUP(\"Koloniezahl bei 36°C\",INDIRECT($C6&\"!B6:C100\"),2,FALSE))=TRUE),\"\",IF(VLOOKUP(\"Koloniezahl bei 36°C\",INDIRECT($C6&\"!B6:C100\"),2,FALSE)=0,\"\",VLOOKUP(\"Koloniezahl bei 36°C\",INDIRECT($C6&\"!B6:C100\"),2,FALSE)))","v":""},{"$f":"IF(OR($C6=\"\",ISNA(VLOOKUP(\"Clostridium perfringens\",INDIRECT($C6&\"!B6:C100\"),2,FALSE))=TRUE),\"\",IF(VLOOKUP(\"Clostridium perfringens\",INDIRECT($C6&\"!B6:C100\"),2,FALSE)=0,\"\",VLOOKUP(\"Clostridium perfringens\",INDIRECT($C6&\"!B6:C100\"),2,FALSE)))","v":""},{"$f":"IF(OR($C6=\"\",ISNA(VLOOKUP(\"Pseudomonas aeruginosa\",INDIRECT($C6&\"!B6:C100\"),2,FALSE))=TRUE),\"\",IF(VLOOKUP(\"Pseudomonas aeruginosa\",INDIRECT($C6&\"!B6:C100\"),2,FALSE)=0,\"\",VLOOKUP(\"Pseudomonas aeruginosa\",INDIRECT($C6&\"!B6:C100\"),2,FALSE)))","v":""},{"$f":"IF(OR($C6=\"\",ISNA(VLOOKUP(\"Enterokokken\",INDIRECT($C6&\"!B6:C100\"),2,FALSE))=TRUE),\"\",IF(VLOOKUP(\"Enterokokken\",INDIRECT($C6&\"!B6:C100\"),2,FALSE)=0,\"\",VLOOKUP(\"Enterokokken\",INDIRECT($C6&\"!B6:C100\"),2,FALSE)))","v":""},{"$f":"IF(OR(G6=\"T: Häusliche Trinkwasserinstallation\",G6=\"\",AND(H6=\"\",I6=\"\",J6=\"\",K6=\"\",L6=\"\",M6=\"\",N6=\"\")),\"\",\"DIN EN ISO 19458, Zweck a)\")","v":""},{"$f":"IF(OR($C6=\"\",ISNA(VLOOKUP(\"Kupfer\",INDIRECT($C6&\"!B6:C100\"),2,FALSE))=TRUE),\"\",IF(VLOOKUP(\"Kupfer\",INDIRECT($C6&\"!B6:C100\"),2,FALSE)=0,\"\",VLOOKUP(\"Kupfer\",INDIRECT($C6&\"!B6:C100\"),2,FALSE)))","v":""},{"$f":"IF(OR($C6=\"\",ISNA(VLOOKUP(\"Nickel\",INDIRECT($C6&\"!B6:C100\"),2,FALSE))=TRUE),\"\",IF(VLOOKUP(\"Nickel\",INDIRECT($C6&\"!B6:C100\"),2,FALSE)=0,\"\",VLOOKUP(\"Nickel\",INDIRECT($C6&\"!B6:C100\"),2,FALSE)))","v":""},{"$f":"IF(OR($C6=\"\",ISNA(VLOOKUP(\"Blei\",INDIRECT($C6&\"!B6:C100\"),2,FALSE))=TRUE),\"\",IF(VLOOKUP(\"Blei\",INDIRECT($C6&\"!B6:C100\"),2,FALSE)=0,\"\",VLOOKUP(\"Blei\",INDIRECT($C6&\"!B6:C100\"),2,FALSE)))","v":""},{"$f":"IF(OR(G6=\"T: Häusliche Trinkwasserinstallation\",G6=\"\",AND(P6=\"\",Q6=\"\",R6=\"\")),\"\",\"Spülprobe DIN ISO 5667- 5\")","v":""}]
["WVU 2",null,null,null,null,null,null,"","","","","","","","",{"$f":"IF(OR($C7=\"\",ISNA(VLOOKUP(\"Kupfer\",INDIRECT($C7&\"!B6:C100\"),2,FALSE))=TRUE),\"\",IF(VLOOKUP(\"Kupfer\",INDIRECT($C7&\"!B6:C100\"),2,FALSE)=0,\"\",VLOOKUP(\"Kupfer\",INDIRECT($C7&\"!B6:C100\"),2,FALSE)))","v":""},{"$f":"IF(OR($C7=\"\",ISNA(VLOOKUP(\"Nickel\",INDIRECT($C7&\"!B6:C100\"),2,FALSE))=TRUE),\"\",IF(VLOOKUP(\"Nickel\",INDIRECT($C7&\"!B6:C100\"),2,FALSE)=0,\"\",VLOOKUP(\"Nickel\",INDIRECT($C7&\"!B6:C100\"),2,FALSE)))","v":""},{"$f":"IF(OR($C7=\"\",ISNA(VLOOKUP(\"Blei\",INDIRECT($C7&\"!B6:C100\"),2,FALSE))=TRUE),\"\",IF(VLOOKUP(\"Blei\",INDIRECT($C7&\"!B6:C100\"),2,FALSE)=0,\"\",VLOOKUP(\"Blei\",INDIRECT($C7&\"!B6:C100\"),2,FALSE)))","v":""},""]
["WVU 3",null,null,null,null,null,null,"","","","","","","","","","","",""]
["WVU 4",null,null,null,null,null,null,"","","","","","","","","","","",""]
["WVU 5",null,null,null,null,null,null,"","","","","","","","","","","",""]
["WVU 6",null,null,null,null,null,null,"","","","","","","","","","","",""]
["WVU 7",null,null,null,null,null,null,"","","","","","","","","","","",""]
["WVU 8",null,null,null,null,null,null,"","","","","","","","","","","",""]
["WVU 9",null,null,null,null,null,null,"","","","","","","","","","","",""]
["WVU 10",null,null,null,null,null,null,"","","","","","","","","","","",""]
["WVU 11",null,null,null,null,null,null,"","","","","","","","","","","",""]
["WVU 12",null,null,null,null,null,null,"","","","","","","","","","","",""]
["WVU 13",null,null,null,null,null,null,"","","","","","","","","","","",""]
["WVU 14",null,null,null,null,null,null,"","","","","","","","","","","",""]
["WVU 15",null,null,null,null,null,null,"","","","","","","","","","","",""]
["WVU 16",null,null,null,null,null,null,"","","","","","","","","","","",""]
["WVU 17",null,null,null,null,null,null,"","","","","","","","","","","",""]
["WVU 18",null,null,null,null,null,null,"","","","","","","","","","","",""]
["WVU 19",null,null,null,null,null,null,"","","","","","","","","","","",""]
["WVU 20",null,null,null,null,null,null,"","","","","","","","","","","",""]
["WVU 21",null,null,null,null,null,null,"","","","","","","","","","","",""]
["WVU 22",null,null,null,null,null,null,"","","","","","","","","","","",""]
["WVU 23",null,null,null,null,null,null,"","","","","","","","","","","",""]
["WVU 24",null,null,null,null,null,null,"","","","","","","","","","","",""]
["WVU 25",null,null,null,null,null,null,"","","","","","","","","","","",""]
{"$rows_left_out":976}
{"sheet":"Terminplan GA","index":3,"n_rows":55,"n_cols":22,"rows_kept":55,"cut":false,"hidden":false,"merged":[[3,7,3,18],[1,0,1,8]]}
["Terminplan GA",null,{"$f":"CONCATENATE('Allgemeine Angaben'!B5,\" \",'Allgemeine Angaben'!B1)","v":" 2014"}]
["Auszufüllen durch das Gesundheitsamt. Untersuchungen, die das Gesundheitsamt selbst durchführt oder von anderen UsI erhält, z.B. aus Trinkwasser-Installationen. Das Gesundheitsamt kann hierfür weitere Messprogramme anlegen, die mindestens die Parameter umfassen, die in den Trinkwasserbericht der WVA übernommen werden.\nSofern das Gesundheitsamt von vornherein eigene Proben nach § 19 plant, diese dem Wasserversorgungsunternehmen in Rechnung stellt und auf den Untersuchungsumfang des Wasserversorgungsunternehmens nach § 14 anrechnen lässt, soll diese Tabelle vor der Abstimmung mit dem WVU ausgefüllt werden. Andernfalls kann diese Tabelle leer bleiben oder ausgeblendet werden und dient dem Gesundheitsamt nach der Abstimmung mit dem WVU zur Festlegung der ggf notwendigen ergänzenden Probennahmen.\nDie Tabelle kann auf den notwendigen Umfang der ergänzenden Probennahmen gekürzt werden."]
[]
["Lfd.Nr.","Datum (Kalenderwoche)","Messprogramm\n","Objektkennzahl","Name Messstelle","bei Sammelmessstellen: \n","Stelle der Probennahme (Code)\n","Probennahmeverfahren (Zutreffendes bitte aus Dropdownliste auswählen!)",null,null,null,null,null,null,null,null,null,null,null,"Untersuchung durch","Ersatz für ","Bemerkung"]
[null,null,"(MP1 oder MP2…, zutreffendes bitte aus Dropdownliste auswählen!)",null,null,"eindeutige Bezeichnung der Probenentnahmestelle","(Zutreffendes bitte aus Dropdownliste auswählen!)","E. coli","Coliforme Bakt.","Koloniezahl  22°C","Koloniezahl 36°C","C. perfringens","P.aeruginosa.","Enterokken","Probennahme Mikrobiologie","Kupfer","Nickel","Blei","Probennahme Schwermetalle","(Zutreffendes bitte aus Dropdownliste auswählen!)","WVU-Probe (Lfd.Nr.)"]
["GA 1",null,null,null,null,null,null,{"$f":"IF(OR($C6=\"\",ISNA(VLOOKUP(\"Escherichia coli (E. coli)\",INDIRECT($C6&\"!B6:C100\"),2,FALSE))=TRUE),\"\",IF(VLOOKUP(\"Escherichia coli (E. coli)\",INDIRECT($C6&\"!B6:C100\"),2,FALSE)=0,\"\",VLOOKUP(\"Escherichia coli (E. coli)\",INDIRECT($C6&\"!B6:C100\"),2,FALSE)))","v":""},{"$f":"IF(OR($C6=\"\",ISNA(VLOOKUP(\"Coliforme Bakterien\",INDIRECT($C6&\"!B6:C100\"),2,FALSE))=TRUE),\"\",IF(VLOOKUP(\"Coliforme Bakterien\",INDIRECT($C6&\"!B6:C100\"),2,FALSE)=0,\"\",VLOOKUP(\"Coliforme Bakterien\",INDIRECT($C6&\"!B6:C100\"),2,FALSE)))","v":""},{"$f":"IF(OR($C6=\"\",ISNA(VLOOKUP(\"Koloniezahl bei 22°C\",INDIRECT($C6&\"!B6:C100\"),2,FALSE))=TRUE),\"\",IF(VLOOKUP(\"Koloniezahl bei 22°C\",INDIRECT($C6&\"!B6:C100\"),2,FALSE)=0,\"\",VLOOKUP(\"Koloniezahl bei 22°C\",INDIRECT($C6&\"!B6:C100\"),2,FALSE)))","v":""},{"$f":"IF(OR($C6=\"\",ISNA(VLOOKUP(\"Koloniezahl bei 36°C\",INDIRECT($C6&\"!B6:C100\"),2,FALSE))=TRUE),\"\",IF(VLOOKUP(\"Koloniezahl bei 36°C\",INDIRECT($C6&\"!B6:C100\"),2,FALSE)=0,\"\",VLOOKUP(\"Koloniezahl bei 36°C\",INDIRECT($C6&\"!B6:C100\"),2,FALSE)))","v":""},{"$f":"IF(OR($C6=\"\",ISNA(VLOOKUP(\"Clostridium perfringens\",INDIRECT($C6&\"!B6:C100\"),2,FALSE))=TRUE),\"\",IF(VLOOKUP(\"Clostridium perfringens\",INDIRECT($C6&\"!B6:C100\"),2,FALSE)=0,\"\",VLOOKUP(\"Clostridium perfringens\",INDIRECT($C6&\"!B6:C100\"),2,FALSE)))","v":""},{"$f":"IF(OR($C6=\"\",ISNA(VLOOKUP(\"Pseudomonas aeruginosa\",INDIRECT($C6&\"!B6:C100\"),2,FALSE))=TRUE),\"\",IF(VLOOKUP(\"Pseudomonas aeruginosa\",INDIRECT($C6&\"!B6:C100\"),2,FALSE)=0,\"\",VLOOKUP(\"Pseudomonas aeruginosa\",INDIRECT($C6&\"!B6:C100\"),2,FALSE)))","v":""},{"$f":"IF(OR($C6=\"\",ISNA(VLOOKUP(\"Enterokokken\",INDIRECT($C6&\"!B6:C100\"),2,FALSE))=TRUE),\"\",IF(VLOOKUP(\"Enterokokken\",INDIRECT($C6&\"!B6:C100\"),2,FALSE)=0,\"\",VLOOKUP(\"Enterokokken\",INDIRECT($C6&\"!B6:C100\"),2,FALSE)))","v":""},{"$f":"IF(OR(G6=\"T: Häusliche Trinkwasserinstallation\",G6=\"\",AND(H6=\"\",I6=\"\",J6=\"\",K6=\"\",L6=\"\",M6=\"\",N6=\"\")),\"\",\"DIN EN ISO 19458, Zweck a)\")","v":""},{"$f":"IF(OR($C6=\"\",ISNA(VLOOKUP(\"Kupfer\",INDIRECT($C6&\"!B6:C100\"),2,FALSE))=TRUE),\"\",IF(VLOOKUP(\"Kupfer\",INDIRECT($C6&\"!B6:C100\"),2,FALSE)=0,\"\",VLOOKUP(\"Kupfer\",INDIRECT($C6&\"!B6:C100\"),2,FALSE)))","v":""},{"$f":"IF(OR($C6=\"\",ISNA(VLOOKUP(\"Nickel\",INDIRECT($C6&\"!B6:C100\"),2,FALSE))=TRUE),\"\",IF(VLOOKUP(\"Nickel\",INDIRECT($C6&\"!B6:C100\"),2,FALSE)=0,\"\",VLOOKUP(\"Nickel\",INDIRECT($C6&\"!B6:C100\"),2,FALSE)))","v":""},{"$f":"IF(OR($C6=\"\",ISNA(VLOOKUP(\"Blei\",INDIRECT($C6&\"!B6:C100\"),2,FALSE))=TRUE),\"\",IF(VLOOKUP(\"Blei\",INDIRECT($C6&\"!B6:C100\"),2,FALSE)=0,\"\",VLOOKUP(\"Blei\",INDIRECT($C6&\"!B6:C100\"),2,FALSE)))","v":""},{"$f":"IF(OR(G6=\"T: Häusliche Trinkwasserinstallation\",G6=\"\",AND(P6=\"\",Q6=\"\",R6=\"\")),\"\",\"Spülprobe DIN ISO 5667- 5\")","v":""}]
["GA 2",null,null,null,null,null,null,"","","","","","","","",{"$f":"IF(OR($C7=\"\",ISNA(VLOOKUP(\"Kupfer\",INDIRECT($C7&\"!B6:C100\"),2,FALSE))=TRUE),\"\",IF(VLOOKUP(\"Kupfer\",INDIRECT($C7&\"!B6:C100\"),2,FALSE)=0,\"\",VLOOKUP(\"Kupfer\",INDIRECT($C7&\"!B6:C100\"),2,FALSE)))","v":""},{"$f":"IF(OR($C7=\"\",ISNA(VLOOKUP(\"Nickel\",INDIRECT($C7&\"!B6:C100\"),2,FALSE))=TRUE),\"\",IF(VLOOKUP(\"Nickel\",INDIRECT($C7&\"!B6:C100\"),2,FALSE)=0,\"\",VLOOKUP(\"Nickel\",INDIRECT($C7&\"!B6:C100\"),2,FALSE)))","v":""},{"$f":"IF(OR($C7=\"\",ISNA(VLOOKUP(\"Blei\",INDIRECT($C7&\"!B6:C100\"),2,FALSE))=TRUE),\"\",IF(VLOOKUP(\"Blei\",INDIRECT($C7&\"!B6:C100\"),2,FALSE)=0,\"\",VLOOKUP(\"Blei\",INDIRECT($C7&\"!B6:C100\"),2,FALSE)))","v":""},""]
["GA 3",null,null,null,null,null,null,"","","","","","","","","","","",""]
["GA 4",null,null,null,null,null,null,"","","","","","","","","","","",""]
["GA 5",null,null,null,null,null,null,"","","","","","","","","","","",""]
["GA 6",null,null,null,null,null,null,"","","","","","","","","","","",""]
["GA 7",null,null,null,null,null,null,"","","","","","","","","","","",""]
["GA 8",null,null,null,null,null,null,"","","","","","","","","","","",""]
["GA 9",null,null,null,null,null,null,"","","","","","","","","","","",""]
["GA 10",null,null,null,null,null,null,"","","","","","","","","","","",""]
["GA 11",null,null,null,null,null,null,"","","","","","","","","","","",""]
["GA 12",null,null,null,null,null,null,"","","","","","","","","","","",""]
["GA 13",null,null,null,null,null,null,"","","","","","","","","","","",""]
["GA 14",null,null,null,null,null,null,"","","","","","","","","","","",""]
["GA 15",null,null,null,null,null,null,"","","","","","","","","","","",""]
["GA 16",null,null,null,null,null,null,"","","","","","","","","","","",""]
["GA 17",null,null,null,null,null,null,"","","","","","","","","","","",""]
["GA 18",null,null,null,null,null,null,"","","","","","","","","","","",""]
["GA 19",null,null,null,null,null,null,"","","","","","","","","","","",""]
["GA 20",null,null,null,null,null,null,"","","","","","","","","","","",""]
["GA 21",null,null,null,null,null,null,"","","","","","","","","","","",""]
["GA 22",null,null,null,null,null,null,"","","","","","","","","","","",""]
["GA 23",null,null,null,null,null,null,"","","","","","","","","","","",""]
["GA 24",null,null,null,null,null,null,"","","","","","","","","","","",""]
["GA 25",null,null,null,null,null,null,"","","","","","","","","","","",""]
{"$rows_left_out":26}
{"sheet":"MP1","index":4,"n_rows":22,"n_cols":9,"rows_kept":22,"cut":false,"hidden":false,"merged":[[2,0,2,5]]}
["MP1","Messprogramm 1 ","Routinemäßige Untersuchungen",null,null,{"$f":"CONCATENATE('Allgemeine Angaben'!B5,\" \",'Allgemeine Angaben'!B1)","v":" 2014"}]
["Häufigkeit:","Routinemäßige Untersuchungen"]
["Auszufüllen vom Gesundheitsamt für die jeweilige WVA. Die entsprechend der Spalte „Bemerkungen“ nicht zutreffenden Parameter sind durch das GA aus dem Untersuchungsumfang herauszunehmen. Außerdem sind die nicht zutreffenden Parameterschlüssel bei E.coli und Coliformen zu löschen. \nDie im Verteilungsnetz veränderlichen Parameter müssen an der Stelle der Verwendung oder an der Übergabestelle in die Trinkwasser-Installation beprobt werden!"]
[]
["Lfd. Nr.","Parameter","Zu untersuchende Parameter ankreuzen (x)","Parameterschlüs-sel","Im Verteilungsnetz veränderlich?","Bemerkung"]
["MP1-1","Aluminium","x",1131,"nein","bei Flockung mit Aluminiumverbindungen",null,null,""]
["MP1-2","Ammonium","x",1248,"nein",null,null,null,""]
["MP1-3","Eisen","x",1182,"ja","bei Flockung mit Eisenverbindungen",null,null,""]
["MP1-4","Färbung","x",1027,"ja",null,null,null,""]
["MP1-5","Geruch","x","1046, 1042","ja","Die Vorgabe wird durch Parameter 1046 oder 1042 im Befund erfüllt.\nBei anderen Ergebnissen für Parameter 1042 (Geruch) als 100 (ohne), 201 (schwach Chlor) oder 210 (schwach erdig) ist Parameter 1046 (Geruchsschwellenwert) zu bestimmen.",null,null,""]
["MP1-6","Geschmack","x",1052,"ja","Bei Verdacht auf eine mikrobielle Kontamination kann auf eine Geschmacksprobe verzichtet\nwerden.",null,null,""]
["MP1-7","Elektrische Leitfähigkeit","x",1081,"nein",null,null,null,""]
["MP1-8","Trübung","x",1035,"ja","Bei Trübungen über 1,0 NTU im Verteilungsnetz ist ergänzend die sensorische Beurteilung der Trübung (Parameter 1031) anzugeben."]
["MP1-9","Wasserstoffionenkonzentration ","x","1061, 1064","nein","Die Vorgabe wird durch Parameter 1061 oder 1064 im Befund erfüllt."]
[null,"Parameter über deren Probennahmeverfahren berichtet werden muss:"]
["MP1-10","Escherichia coli (E. coli)","x","1772 (1766)","ja","Pmt-Schlüssel in Klammern bei Abfüllung in Flaschen und Behältnisse, nicht zutreffenden Schlüssel löschen",null,null,""]
["MP1-11","Coliforme Bakterien","x","1773 (1767)","ja","Pmt-Schlüssel in Klammern bei Abfüllung in Flaschen und Behältnisse, nicht zutreffenden Schlüssel löschen",null,null,""]
["MP1-12","Koloniezahl bei 22°C","x","1779, 1776","ja","Die Vorgabe wird durch Parameter 1779 oder 1776 im Befund erfüllt.",null,null,""]
["MP1-13","Koloniezahl bei 36°C","x","1780, 1777","ja","Die Vorgabe wird durch Parameter 1780 oder 1777 im Befund erfüllt.",null,null,""]
["MP1-14","Clostridium perfringens","x",1778,"ja","nur bei Oberflächenwassereinfluss",null,null,""]
["MP1-15","Pseudomonas aeruginosa",null,1769,"ja","nur bei Abfüllung in Flaschen und Behältnisse"]
["MP1-16","Enterokokken",null,"1774 (1768)","ja","Nach TrinkwV in der Umfassenden Untersuchung durchzuführen, wird aber häufig im Rahmen der routinemäßigen Untersuchungen kontrolliert.\nPmt-Schlüssel in Klammern bei Abfüllung in Flaschen und Behältnisse, nicht zutreffenden Schlüssel löschen"]

{"sheet":"MP2","index":5,"n_rows":42,"n_cols":8,"rows_kept":42,"cut":false,"hidden":false,"merged":[[2,0,2,5]]}
["MP2","Messprogramm 2","Umfassende Untersuchungen ohne PSM",null,null,{"$f":"CONCATENATE('Allgemeine Angaben'!B5,\" \",'Allgemeine Angaben'!B1)","v":" 2014"}]
["Häufigkeit:","Umfassende Untersuchungen"]
["Auszufüllen vom Gesundheitsamt für die jeweilige WVA. Im Messprogramm der umfassenden Untersuchung können vom GA geogen-, material- und aufbereitungsbedingt ausschließbare Parameter herausgenommen und bei Bedarf zusätzliche Parameter (z.B. bei Wasseraufbereitung) aufgenommen werden. \nDie im Verteilungsnetz veränderlichen Parameter müssen an der Stelle der Verwendung oder an der Übergabestelle in die Trinkwasser-Installation beprobt werden!"]
[]
["Lfd.Nr.","Parameter","Zu untersuchende Parameter ankreuzen (x)","Parameterschlüs-sel","Im Verteilungsnetz veränderlich?","Bemerkung"]
["MP2-1","1,2-Dichlorethan","x",2008,"nein"]
["MP2-2","Acrylamid","x",380,"nein","nur bei Flockung mit Polyacrylamid,, Untersuchung oder Berechnung nach Polymerdosis"]
["MP2-3","Aluminium","x",1131,"nein","falls nicht in Routine untersucht"]
["MP2-4","Antimon","x",1145,"ja"]
["MP2-5","Arsen","x",1142,"ja"]
["MP2-6","Benzo-(a)-pyren","x",2454,"ja"]
["MP2-7","Benzol","x",2371,"nein"]
["MP2-8","Bor","x",1211,"nein"]
["MP2-9","Bromat","x",1325,"nein","nur bei bromidhaltigen Wässern, die mit Ozon aufbereitet werden."]
["MP2-10","Cadmium","x",1165,"ja"]
["MP2-11","Calcitlösekapazität","x",1078,"nein","erfüllt, wenn der pH-Wert am Wasserwerksausgang ≥ 7,7 ist."]
["MP2-12","Chlorid","x",1331,"nein"]
["MP2-13","Chrom","x",1151,"nein"]
["MP2-14","Cyanid","x",1231,"nein"]
["MP2-15","Eisen","x",1182,"ja","falls nicht in Routine untersucht"]
["MP2-16","Epichlorhydrin","x",381,"ja","nur bei Epoxidharzmaterialien, die nicht den a.a.R.d.T entsprechen"]
["MP2-17","Fluorid","x",1321,"nein"]
["MP2-18","Mangan","x",1171,"nein"]
["MP2-19","Natrium","x",1112,"nein"]
["MP2-20","Nitrat","x",1244,"nein"]
["MP2-21","Nitrat/Nitrit Formel","x",1254,"ja"]
["MP2-22","Nitrit","x",1246,"ja"]
["MP2-23","Organisch gebundener Kohlenstoff (TOC) ","x",1523,"ja"]
["MP2-24","Oxidierbarkeit","x",1532,"nein","braucht nicht untersucht zu werden, wenn TOC untersucht wird"]
["MP2-25","Polyzyklische aromatische Kohlenwasserstoffe","x",1570,"ja"]
{"$rows_left_out":13}
{"sheet":"MP3","index":6,"n_rows":190,"n_cols":7,"rows_kept":190,"cut":false,"hidden":false,"merged":[[2,0,2,6]]}
["MP3","Messprogramm 3","PSM-Wirkstoffe und Biozidprodukt-Wirkstoffe ",null,null,null,{"$f":"CONCATENATE('Allgemeine Angaben'!B5,\" \",'Allgemeine Angaben'!B1)","v":" 2014"}]
["Häufigkeit:","Umfassende Untersuchungen"]
["Auszufüllen in Abstimmung zwischen Gesundheitsamt und Wasserversorgungsunternehmen. \nDiese Tabelle enthält als Hilfestellung Parameter aus den bisherigen Trinkwasserberichten. Diese Auswahl an PSM in dieser Tabelle gibt weder Minimal- noch Maximalumfang vor, sondern ist nur als Hilfestellung bei der Festlegung gedacht. \nAlternativ können die individuell für die WVA mindestens zu untersuchenden PSM mit der Arbeitshilfe des PSM-Konzeptes ermittelt und an Stelle der hier aufgeführten Parameter eingetragen werden.\nDie Probennahme soll repräsentativ für das abgegebene Trinkwasser erfolgen, dies kann auch im Wasserwerk sein."]
[]
["Lfd. Nr.","Parameter","CAS-Nummer","Zu untersuchende Parameter ankreuzen (x)","Parameter-schlüssel ","Im Verteilungsnetz veränderlich?","Bemerkung"]
["MP3-1","Pestizide insgesamt","-","x",2200,"nein"]
["MP3-2","2,4,5-T","93-76-5",null,2230,"nein"]
["MP3-3","2,4-D","94-75-7",null,2229,"nein"]
["MP3-4","2,4-DB","94-82-6",null,2231,"nein"]
["MP3-5","2,6-Dichlorbenzonitril","1194-65-6",null,2126,"nein"]
["MP3-6","4-CPA","122-88-3",null,3255,"nein"]
["MP3-7","Abamectin","71751-41-2",null,3013,"nein"]
["MP3-8","Aclonifen","74070-46-5",null,3187,"nein"]
["MP3-9","Alachlor","15972-60-8",null,3137,"nein"]
["MP3-10","Aldicarb","116-06-3",null,3256,"nein"]
["MP3-11","Aldrin","309-00-2",null,2210,"nein"]
["MP3-12","alpha-Endosulfan","959-98-8",null,2220,"nein"]
["MP3-13","alpha-HCH","319-84-6",null,2201,"nein"]
["MP3-14","Ametryn","834-12-8",null,3065,"nein"]
["MP3-15","Amidosulfuron","120923-37-7",null,3175,"nein"]
["MP3-16","Aminomethylphosphonsäure","1066-51-9",null,3021,"nein"]
["MP3-17","Atraton","1610-17-9",null,3103,"nein"]
["MP3-18","Atrazin","1912-24-9",null,3051,"nein"]
["MP3-19","Azoxystrobin","131860-33-8",null,3185,"nein"]
["MP3-20","Bentazon","25057-89-0",null,3102,"nein"]
["MP3-21","beta-Endosulfan","33213-65-9",null,2221,"nein"]
["MP3-22","beta-HCH","319-85-7",null,2202,"nein"]
["MP3-23","Bifenox","42576-02-3",null,3141,"nein"]
["MP3-24","Boscalid","188425-85-6",null,3228,"nein"]
["MP3-25","Bromacil","314-40-9",null,3150,"nein"]
{"$rows_left_out":160}